package ifupdown 0.6.8ubuntu29.1 failed to install/upgrade: error writing to '<standard output>': Input/output error

Bug #626157 reported by Sharkz
6
This bug affects 1 person
Affects Status Importance Assigned to Milestone
ifupdown (Ubuntu)
New
Undecided
Unassigned

Bug Description

Binary package hint: ifupdown

I have no idea what this is and how it happen

ProblemType: Package
DistroRelease: Ubuntu 10.04
Package: ifupdown 0.6.8ubuntu29.1
ProcVersionSignature: Ubuntu 2.6.32-24.41-generic 2.6.32.15+drm33.5
Uname: Linux 2.6.32-24-generic i686
Architecture: i386
Date: Wed Aug 25 10:57:42 2010
ErrorMessage: error writing to '<standard output>': Input/output error
SourcePackage: ifupdown
Title: package ifupdown 0.6.8ubuntu29.1 failed to install/upgrade: error writing to '<standard output>': Input/output error

Revision history for this message
Sharkz (coolgang-shakthi) wrote :
Revision history for this message
Robert Roth (evfool) wrote :

Thank you for taking the time to report this bug and helping to make Ubuntu better. This particular bug has already been reported and is a duplicate of bug #545790, so it is being marked as such. Please look at the other bug report to see if there is any missing information that you can provide, or to see if there is a workaround for the bug. Additionally, any further discussion regarding the bug should occur in the other report. Feel free to continue to report any other bugs you may find.
---
Ubuntu Bug Squad volunteer triager
http://wiki.ubuntu.com/BugSquad

To post a comment you must log in.
This report contains Public information  
Everyone can see this information.

Other bug subscribers

Remote bug watches

Bug watches keep track of this bug in other bug trackers.