package tk8.5 8.5.8-1 failed to install/upgrade: error writing to '<standard output>': Success

Bug #900288 reported by Colin Walker
6
This bug affects 1 person
Affects Status Importance Assigned to Milestone
tk8.5 (Ubuntu)
New
Undecided
Unassigned

Bug Description

Alerted to crash by Ubuntu. Did'nt know anything was amiss.

ProblemType: Package
DistroRelease: Ubuntu 10.04
Package: tk8.5 8.5.8-1
ProcVersionSignature: Ubuntu 2.6.32-122.35.rtai-rtai 2.6.32.11+drm33.2
Uname: Linux 2.6.32-122-rtai i686
Architecture: i386
Date: Mon Dec 5 06:30:28 2011
ErrorMessage: error writing to '<standard output>': Success
InstallationMedia: Ubuntu 10.04.3 LTS "Lucid Lynx" - Release i386 (20110720.1)
SourcePackage: tk8.5
Title: package tk8.5 8.5.8-1 failed to install/upgrade: error writing to '<standard output>': Success

Revision history for this message
Colin Walker (chwalker) wrote :
Revision history for this message
Brian Murray (brian-murray) wrote :

Thank you for taking the time to report this bug and helping to make Ubuntu better. This particular bug has already been reported and is a duplicate of bug 545790, so it is being marked as such. Please look at the other bug report to see if there is any missing information that you can provide, or to see if there is a workaround for the bug. Additionally, any further discussion regarding the bug should occur in the other report. Please continue to report any other bugs you may find.

To post a comment you must log in.
This report contains Public information  
Everyone can see this information.

Other bug subscribers

Remote bug watches

Bug watches keep track of this bug in other bug trackers.